kirjoittaminen
preferred label: writing @en
preferred label: skrivande @sv
type: Concept
narrower: verkkokirjoittaminen

kirjoittaminen julkaisupaikan mukaan
type: Collection
member: verkkokirjoittaminen

verkkokirjoittaminen
type: Concept
source: Lähde: Tietotekniikan termitalkoot
preferred label: nätskrivande @sv
preferred label: web writing @en
scope note: Tarkoittaa kirjoittamista, jossa tuotetaan tietoverkkoon sijoitettava teksti
broader: kirjoittaminen
in scheme: conceptscheme