reception (transfer of ownership)
preferred label: saanti (omistuksen siirtäminen) @fi
preferred label: förvärv @sv
type: Concept
narrower: recovery, legal proceedings

recovery, legal proceedings
source: Kielitoimiston sanakirja
preferred label: återvinning -- juridik @sv
preferred label: takaisinsaanti @fi
type: Concept
broader: reception (transfer of ownership)
comment: määräolosuhteiden ennalleen saattamisesta vars. konkurssin t. ulosoton yhteydessä; eräs muutoksenhakukeino
in scheme: conceptscheme