aine
preferred label: matter @en
preferred label: materia @sv
type: Concept
narrower: komposiitit

aine rakenteen mukaan
type: Collection
member: komposiitit

komposiitit
preferred label: kompositer @sv
preferred label: composites @en
type: Concept
source: Muovitermit
broader: aine
comment: materiaali, joka koostuu kahdesta tai useammasta selvästi erottuvasta faasista, joista toinen, tavallisesti yhtenäinen faasi, on sideaineena ja toinen, esimerkiksi rakeinen tai kuitumainen, runkoaineena Komposiitit jaetaan massakomposiitteihin, jotka koostuvat eri materiaalien sekoitteesta (esim. talkkiseosteinen polypropeeni), ja kerroskomposiitteihin, jotka koostuvat erillisistä materiaalikerroksista (esim. lujitemuoviveneen runko).
in scheme: conceptscheme