offentliga byggnader
preferred label: public buildings @en
preferred label: julkiset rakennukset @fi
type: Concept
narrower: Ostrobotnia

Ostrobotnia
broader: offentliga byggnader
scope note: Wäinö Palmqvistin suunnittelema pohjalaisten ylioppilasosakuntien talo Helsingissä
in scheme: conceptscheme
type: Concept