Lollards
broader: religious communities
scope note: Englannissa John Wycliffin kannattajien nimitys
in scheme: conceptscheme
preferred label: lollarder @sv
preferred label: lollardit @fi
type: Concept

religious communities
preferred label: religiösa samfund @sv
preferred label: uskonnolliset yhteisöt @fi
type: Concept
narrower: Lollards