förvaringsrelaterat objekt
preferred label: object related to storage @en
preferred label: säilytykseen liittyvä objekti @fi
type: Concept
narrower: medicinskåp

medicinskåp
broader: förvaringsrelaterat objekt
scope note: Sanalla on kaksi merkitystä. 1. Lääkkeiden säilytyskaappi. 2. Apteekin käsikauppalääkkeiden myyntipiste syrjäseudulla
in scheme: conceptscheme
preferred label: medicine cabinets @en
preferred label: lääkekaapit @fi
type: Concept