metoder
preferred label: menetelmät @fi
preferred label: methods @en
type: Concept
narrower: mätmetoder

DAP measurement
preferred label: DAP-mittaus @fi
type: Concept
broader: mätmetoder

mätmetoder
alternative label: mätningsmetoder
alternative label: mittaamismenetelmät @fi
preferred label: mittausmenetelmät @fi
preferred label: measuring methods @en
type: Concept
scope note: Mittausmenetelmien nimiä voi käyttää asiasanoina
scope note: Namnen på olika mätmetoder kan användas som ämnesord vid indexering
broader: metoder
in scheme: conceptscheme
narrower: DAP measurement