Java
type: Concept
related: JSP

JSP
related: Java
type: Concept
broader: ohjelmointikielet
source: Lähde: Jaakohuhta, H., IT-ensyklopedia, 2.p.
alternative label: Java Server Pages
scope note: WWW-sivut, jotka käyttävät Java-ohjelmointikieltä dynaamisen sisällön luontiin
in scheme: conceptscheme

ohjelmointikielet
preferred label: programmeringsspråk @sv
preferred label: programming languages @en
type: Concept
narrower: JSP