type approval
broader: acceptance
scope note: Jatkuvasti valmistettavan tuotteen tai tuoteryhmän hyväksyntä, joka perustuu hyväksyvän elimen edustavaksi katsomaan näytteeseen
in scheme: conceptscheme
preferred label: typgodkännande @sv
preferred label: tyyppihyväksyntä @fi
type: Concept

acceptance
preferred label: hyväksyminen (vahvistaminen) @fi
preferred label: godkännande @sv
type: Concept
narrower: type approval