teologia
preferred label: theology @en
preferred label: teologi @sv
type: Concept
narrower: apologetiikka

apologetiikka
broader: teologia
in scheme: conceptscheme
preferred label: apologetics @en
preferred label: apologetik @sv
comment: Teologian haara, jonka tehtävänä on kristillisen uskon puolustaminen (kr. apologia). Sen alaan kuuluu muun muassa rajankäynti teologian ja muiden tieteiden kesken sekä ilmoituksen luonteen selvittäminen. Apologeettista keskustelua käydään usein filosofisin käsittein, vaikka filosofia ei itsessään riitä Jumalan tuntemiseen. [Kirkollinen sanasto]
type: Concept
alternative label: kristinuskon puolustaminen