Gopher
broader: technical systems
source: Atk-sanakirja
comment: Internet-verkossa WWW:tä edeltänyt tekstidokumenttien haku- ja saantikäytäntö
in scheme: conceptscheme
type: Concept

technical systems
preferred label: tekniset järjestelmät @fi
type: Concept
narrower: Gopher