hydrografi
scope note: Kartläggning av sjöar och floder och dessas areal- och djupförhållanden; inom oceanografin kartläggning av farvatten för navigationsändamål.
related: hydrologi
preferred label: hydrografia @fi
preferred label: hydrography @en
broader: geofysik
in scheme: conceptscheme
type: Concept

hydrologi
preferred label: hydrology @en
preferred label: hydrologia @fi
type: Concept
related: hydrografi

geofysik
preferred label: geophysics @en
preferred label: geofysiikka @fi
type: Concept
narrower: hydrografi