kilvet (konkreettinen eloton objekti)
narrower: rekisterikilvet
preferred label: skölar @sv
preferred label: shields @en
comment: kupumaisista ja levymäisistä esineistä, esim. tauluista, laatoista, tms., joissa on nimi, ohje tm. tekstiä; kyltti
in scheme: conceptscheme
broader: konkreettinen eloton objekti
type: Concept
alternative label: kilvet
source: Suomen kielen perussanakirja

rekisterikilvet
preferred label: numberplates @en
preferred label: registerskyltar @sv
type: Concept
broader: kilvet (konkreettinen eloton objekti)

konkreettinen eloton objekti
preferred label: concrete inanimate object @en
preferred label: konkret icke-levande objekt @sv
type: Concept
narrower: kilvet (konkreettinen eloton objekti)