rannikot
preferred label: coasts @en
preferred label: kuster @sv
type: Concept
related: marskimaa

marskimaa
related: rannikot
preferred label: marsh @en
preferred label: marskland @sv
in scheme: conceptscheme
broader: luonnon muodostamat alueet
alternative label: marski
scope note: Flackt, tidvattenpåverkat kustområde där leriga, sandiga sediment avsätts eller transporteras bort i växlingen mellan flod och ebb. @sv
type: Concept

luonnon muodostamat alueet
preferred label: areas created by nature @en
type: Concept
narrower: marskimaa