Brahelinna
broader: linnat
scope note: Borgruin i Kristina kommun i Södra Savolax. Borgen byggdes på 1600-talet och förstördes under Stora ofreden i början av 1700-talet. @sv
alternative label: Brahenlinna
in scheme: conceptscheme
type: Concept

linnat
preferred label: castles @en
preferred label: slott @sv
type: Concept
narrower: Brahelinna