rakennukset rakennustyypin mukaan
type: Collection
member: passiivitalot

passiivitalot
preferred label: passivhus @sv
preferred label: passive houses @en
related: matalaenergiatalot
scope note: Ett passivhus är en byggnad för vilken termisk komfort kan uppnås genom temperering av den mängd tilluft som krävs för tillräcklig luftkvalitet - utan att använda återcirkulation av luft. @sv
type: Concept
broader: rakennukset
in scheme: conceptscheme
alternative label: passiiviset talot

rakennukset
preferred label: buildings @en
preferred label: byggnader @sv
type: Concept
narrower: passiivitalot

matalaenergiatalot
preferred label: low-energy houses @en
preferred label: lågenergihus @sv
type: Concept
related: passiivitalot