centrifugalkraft
preferred label: keskipakovoima @fi
preferred label: centrifugal force @en
type: Concept
related: centralkraft

kraft
preferred label: voima (johdannaissuureet) @fi
preferred label: power @en
type: Concept
narrower: centralkraft

centralkraft
in scheme: conceptscheme
type: Concept
related: centrifugalkraft
preferred label: keskeisvoima @fi
preferred label: central force @en
broader: kraft
scope note: Kraft vars storlek endast beror av det skalära avståndet från centrum till objektet samt är riktad radiellt från centrum.