fladat
preferred label: flads @en
preferred label: flador @sv
type: Concept
related: kluuvit

kluuvit
broader: järvet
in scheme: conceptscheme
preferred label: gloe lakes @en
preferred label: glon @sv
scope note: Då en flada slutgiltigt avsnörs från havet blir den ett glo, som endast tidvis, då havsvattennivån är höjd, är i kontakt med havet. @sv
alternative label: glojärvet
alternative label: kluuvijärvet
type: Concept
related: fladat

järvet
preferred label: lakes @en
preferred label: sjöar @sv
type: Concept
narrower: kluuvit