geografi
preferred label: geography @en
preferred label: maantiede @fi
type: Concept
narrower: hasardgeografi

hasardgeografi
broader: geografi
scope note: Hasardgeografi innefattar olika typer av risker som värden utsätts för. Riskerna kan vara naturgeografiska eller anknutna till mänsklig verksamhet.
in scheme: conceptscheme
preferred label: hazard geography @en
preferred label: hasardimaantiede @fi
type: Concept