emergency access roads
type: Concept
comment: ennalta suunniteltu reitti, jota käyttäen hälytysajoneuvot pääsevät palon sattuessa tai muussa hätätilanteessa riittävän lähelle kohdetta ja sammutusveden ottopaikkoja
preferred label: räddningsvägar @sv
preferred label: pelastustiet @fi
in scheme: conceptscheme
source: Palo- ja pelastussanasto (TSK 33, 2006)
broader: routes

routes
preferred label: rutter @sv
preferred label: reitit @fi
type: Concept
narrower: emergency access roads