verkot (konkreettinen eloton objekti)
broader: konkreettinen eloton objekti
comment: 1) harva lanka-, köysi- tms. kudos tai rakenne; havas, erik. a) em. kudoksesta tehty (korkeuttaan huomattavasti leveämpi, kohoilla ja painoilla vedessä pystyasennossa pysyvä) kalanpyydys; b) (urh.) eräissä pallopeleissä: pelikentän kahtia jakava aita, jonka yli palloa pelataan; c) (urh.) maaliverkko
preferred label: nets @en
preferred label: nät @sv
in scheme: conceptscheme
source: Suomen kielen perussanakirja
narrower: kalaverkot
type: Concept
alternative label: verkot

kalaverkot
preferred label: fisknät @sv
preferred label: fish nets @en
type: Concept
broader: verkot (konkreettinen eloton objekti)

konkreettinen eloton objekti
preferred label: concrete inanimate object @en
preferred label: konkret icke-levande objekt @sv
type: Concept
narrower: verkot (konkreettinen eloton objekti)