diskontinuitet
comment: epäjatkuva - Ei jatkuva. Funktiota sanotaan epäjatkuvaksi jossakin pisteessä, jos sen arvo muuttuu äkillisesti (eli hyppää) kyseisessä pisteessä. Tällaisessa pisteessä on funktion kuvaajassa aukko.
preferred label: discontinuity @en
preferred label: epäjatkuvuus @fi
related: kontinuitet
in scheme: conceptscheme
broader: inre egenskaper
type: Concept
source: http://thesaurus.maths.org

inre egenskaper
preferred label: internal qualities @en
preferred label: sisäiset ominaisuudet @fi
type: Concept
narrower: diskontinuitet

kontinuitet
preferred label: continuity @en
preferred label: jatkuvuus @fi
type: Concept
related: diskontinuitet