vårdarbete
preferred label: nursing work @en
preferred label: hoitotyö @fi
type: Concept
narrower: nätverksarbete

nätverksarbete
preferred label: networking, psychosocial rehabilitation @en
preferred label: verkostotyö @fi
scope note: Tarkoittaa psykososiaalista hoitotyötä, jonka lähtökohta on verkostonäkökulma. Verkostoon voivat kuulua perhe ja sukulaiset, ystävät, työpaikka, päiväkoti, koulu, harrastukset, ammattiauttajat ja viranomaiset
in scheme: conceptscheme
alternative label: arbete i nätverk
related: nätverksterapi
broader: vårdarbete
type: Concept

nätverksterapi
preferred label: verkostoterapia @fi
preferred label: network therapy @en
type: Concept
related: nätverksarbete