Karjalatalo
broader: byggnader
scope note: Karjalan liiton toiminnan keskus Helsingissä; valmistui vuonna 1974
alternative label: Karelska huset (Kottby, Helsingfors)
in scheme: conceptscheme
type: Concept

rakennukset käyttötarkoituksen mukaan
type: Collection
member: Karjalatalo

byggnader
preferred label: buildings @en
preferred label: rakennukset @fi
type: Concept
narrower: Karjalatalo