Leivu people
broader: Latvians
scope note: Tarkoittaa Latvian virolaisperäisiä asukkaita. Leivut ovat nykyään sulautuneet Latvian virolaisiin
related: estonians
in scheme: conceptscheme
preferred label: leivut @fi
type: Concept

Latvians
preferred label: latvialaiset @fi
preferred label: letter @sv
type: Concept
narrower: Leivu people

estonians
preferred label: ester @sv
preferred label: virolaiset @fi
type: Concept
related: Leivu people