kveenit
broader: ulkosuomalaiset
scope note: Pohjoismaiden oloja kuvaavissa varhaiskeskiajan lähteissä mainittu Pohjanlahden itä- ja pohjoisrannikolla asunut suomalainen heimo
alternative label: kainulaiset
in scheme: conceptscheme
preferred label: Kven people @en
type: Concept

ulkosuomalaiset
preferred label: expatriate finns @en
preferred label: utlandsfinländare @sv
type: Concept
narrower: kveenit