arvopaperit
preferred label: värdepapper @sv
preferred label: securities @en
type: Concept
narrower: warrantit (arvopaperit)

optiot
preferred label: optioner @sv
preferred label: options @en
type: Concept
related: warrantit (arvopaperit)

warrantit (arvopaperit)
type: Concept
comment: Arvopaperi, joka oikeuttaa sen haltijan ostamaan tai myymään warrantin ehtojen mukaan määräytyvän kohde-etuuden esim. tietyn määrän tiettyjä osakkeita
preferred label: warrants @en
preferred label: warranter @sv
broader: arvopaperit
related: optiot
alternative label: warrantit
in scheme: conceptscheme
source: Lähde: Taloussanasto
scope note: Sanalla on monia merkityksiä. 1) Yleisen talletusmakasiinin antama talletustodistukseen liittyvä asiakirja, joka antaa haltijalleen panttioikeuden talletettuun tavaraan. 2) Optiotodistus, merkintäoptio. 3) Arvopaperi, joka oikeuttaa sen haltijan ostamaan tai myymään warrantin ehtojen mukaan määräytyvän kohde-etuuden esim. tietyn määrän tiettyjä osakkeita