skatt
preferred label: tax @en
preferred label: vero @fi
type: Concept
narrower: överlåtelseskatt

stämpelskatt
preferred label: stamp duty @en
preferred label: leimavero @fi
type: Concept
related: överlåtelseskatt

överlåtelseskatt
related: stämpelskatt
broader: skatt
preferred label: asset transfer tax @en
preferred label: varainsiirtovero @fi
scope note: Varainsiirtovero korvasi kiinteistön ja arvopaperin luovutuksen leimaveron 1.1.1997
scope note: Ersätter stämpelskatten vid överlåtelse av fastighet och värdepapper från början av 1997
in scheme: conceptscheme
type: Concept