aine
preferred label: matter @en
preferred label: materia @sv
type: Concept
narrower: seerumi

seerumi
type: Concept
comment: 1) valkuaispitoinen liuos, josta solut tm. saostuva osa on poissa; 2) veri josta ovat poissa solut sekä eräät hyytymiseen vaikuttavat aineet
broader: aine
source: Kielitoimiston sanakirja
in scheme: conceptscheme
preferred label: serum @en

aine rakenteen mukaan
type: Collection
member: seerumi