cellulit
related: huden
preferred label: cellulitis @en
preferred label: selluliitti @fi
source: Kielitoimiston sanakirja
type: Concept
in scheme: conceptscheme
comment: 1. kosmet. pienten rasvakertymien takia epätasainen iho(kudos), ?appelsiini-iho?.; 2. lääk. a. ihonalaisen sidekudoksen bakteeritulehdus. b. ohimoluun kartiolisäkkeen tulehdus.
broader: infektion

infektion
preferred label: inflammation @en
preferred label: tulehdus @fi
type: Concept
narrower: cellulit

huden
preferred label: iho @fi
preferred label: skin @en
type: Concept
related: cellulit