Pariskommunen
broader: regeringar
in scheme: conceptscheme
scope note: Pariisin kommuuni viittasi alun perin Pariisin hallitukseen Ranskan suuren vallankumouksen aikaan. Nykyään termi liitetään useimmin sosialistiseen hallintoon, joka lyhytaikaisesti hallitsi Pariisia 26. maaliskuuta - 30. toukokuuta 1871
scope note: Pariskommunen (fr. La commune de Paris) eller endast Kommunen (La commune), namn på två upprorsregeringar, som ryckt till sig den politiska och administrativa makten i Paris.
type: Concept
preferred label: Pariisin kommuuni @fi
preferred label: Paris Commune @en
source: Lähde: Wikipedia

regeringar
preferred label: cabinets @en
preferred label: hallitukset (hallintoviranomaiset) @fi
type: Concept
narrower: Pariskommunen