strider
preferred label: battles @en
preferred label: taistelut @fi
type: Concept
narrower: slaget vid Porrassalmi

Gustaf III:s krig
preferred label: Russo-Swedish War (1788-1790) @en
preferred label: Kustaa III:n sota @fi
type: Concept
related: slaget vid Porrassalmi

slaget vid Porrassalmi
broader: strider
scope note: Mikkelin eteläpuolella 13.6.1789 venäläisten ja Savon prikaatin kesken käyty taistelu
related: Gustaf III:s krig
in scheme: conceptscheme
preferred label: Porrassalmen taistelu @fi
type: Concept