tiedonhallinta
preferred label: information management @en
preferred label: informationshantering @sv
type: Concept
narrower: tiedonlouhinta

tiedonlouhinta
type: Concept
alternative label: databrytning @sv
alternative label: datan louhinta
preferred label: data mining
alternative label: datanlouhinta
alternative label: tiedon louhinta
in scheme: conceptscheme
broader: tiedonhallinta
scope note: Tarkoittaa laajojen, sähköisessä muodossa olevien tietovarantojen hallintaa, analysointia ja hyödyntämistä @sv
preferred label: datautvinning @sv