property
preferred label: omaisuus @fi
preferred label: egendom @sv
type: Concept
narrower: investment assets

investment assets
preferred label: placeringstillgång @sv
preferred label: sijoitusomaisuus @fi
type: Concept
broader: property
source: Lähde: Taloussanasto
scope note: Tarkoittaa raha- , vakuutus- ja eläkelaitosten varojensa sijoittamiseksi tai sijoitustensa turvaamiseksi hankkimia arvopapereita, kiinteistöjä ja muuta vastaavaa omaisuutta saamisia lukuunottamatta
in scheme: conceptscheme