lättlästa böcker
related: lättlästa böcker
related: storstilsböcker
broader: böcker
scope note: Tarkoittaa kirjoja, jotka on suunnattu sekä tavallisille lapsille ja nuorille tukemaan lukemiseen oppimista ja lukuharrastusta että niille lapsille ja nuorille, joilla on ongelmia hahmotus- ja ymmärtämiskyvyssä tai lukemaan oppimisessa. Tekstit ovat helposti luettavia, kuvat selkeitä
scope note: helppolukuiset kirjat + selkokirjat = lättlästa böcker
scope note: Böcker anpassade för personer med lässvårigheter och för grupper med speciella handikapp.
preferred label: helppolukuiset kirjat @fi
preferred label: easy readers @en
in scheme: conceptscheme
type: Concept

böcker
preferred label: books @en
preferred label: kirjat @fi
type: Concept
narrower: lättlästa böcker

lättlästa böcker
preferred label: books in simplified language @en
preferred label: selkokirjat @fi
type: Concept
related: lättlästa böcker

storstilsböcker
preferred label: large type books @en
preferred label: isotekstiset kirjat @fi
type: Concept
related: lättlästa böcker