förvandling
preferred label: alteration @en
preferred label: toisenlaiseksi muuttaminen @fi
type: Concept
narrower: eugenik

eugenik
preferred label: eugenics @en
preferred label: eugeniikka @fi
type: Concept
in scheme: conceptscheme
alternative label: rashygien
alternative label: rotuhygienia @fi
source: Biologian sanakirja
broader: förvandling
comment: ihmisen perimään kohdistuva vaikuttaminen ja sen tutkiminen; tarkoituksena on parantaa tulevien ihmissukupolvien fyysisiä tai henkisiä geneettisiä ominaisuuksia