other phenomena
preferred label: muut ilmiöt @fi
type: Concept
narrower: fractals

chaos theory
preferred label: kaaosteoria @fi
preferred label: kaosteori @sv
type: Concept
related: fractals

fractals
broader: other phenomena
preferred label: fraktaalit @fi
preferred label: fraktaler @sv
type: Concept
comment: pistejoukko jonka muodostaman kuvion (fraktaalikuvion) ulottuvuuksien lukumäärää ei voi ilmaista kokonaisluvulla
related: chaos theory
source: Kielitoimiston sanakirja
in scheme: conceptscheme