ethnic groups
preferred label: etniska grupper @sv
preferred label: etniset ryhmät @fi
type: Concept
related: Creoles

americans
preferred label: amerikaner @sv
preferred label: amerikkalaiset @fi
type: Concept
narrower: Creoles

Creoles
in scheme: conceptscheme
preferred label: kreolit @fi
preferred label: kreoler @sv
comment: 1) Etelä- ja Keski-Amerikassa eurooppalaisten puhdasrotuinen jälkeläinen; 2 Länsi-Intiassa afrikkalaisten orjien ja eurooppalaisten yhteinen jälkeläinen; 3) Louisianassa Yhdysvalloissa syntynyt (kanadan)ranskalaista sukujuurta oleva henkilö
type: Concept
related: ethnic groups
source: MOT Suomi 1.0a
broader: americans