eurooppalaiset
preferred label: europeer @sv
preferred label: europeans @en
type: Concept
narrower: valakit

romanialaiset
preferred label: Romanians @en
preferred label: rumäner @sv
type: Concept
related: valakit

valakit
alternative label: valakialaiset
preferred label: Wallachians @en
preferred label: valakier @sv
in scheme: conceptscheme
scope note: Tarkoittaa Valakian romanialaisia Romaniassa ja Moldaviassa, osin Balkanin maissa. Aikaisemmin tarkoitti myös koko Romanian väestöä
related: romanialaiset
type: Concept
broader: eurooppalaiset