psykokulttuuri
type: Concept
related: psykologisointi

psykologisointi
source: Kielitoimiston sanakirja
related: psykokulttuuri
preferred label: psychologisation @en
preferred label: psykologisering @sv
comment: soveltaa psykologiaa, eritellä psykologisesti (pintapuolisella ja kaavamaisella tavalla)
in scheme: conceptscheme
broader: kognitio
type: Concept

kognitio
preferred label: kognition @sv
preferred label: cognition @en
type: Concept
narrower: psykologisointi