ihmisen määrittämät alueet
preferred label: areas defined by human @en
type: Concept
narrower: tuomiokunnat (alueet)

tuomiokunnat (alueet)
in scheme: conceptscheme
preferred label: judicial districts @en
preferred label: domsagor @sv
comment: Oikeudenkäymiskaaren 2 luvun 1 §:n mukaan kihlakunnanoikeuden tuomiopiirinä on käräjäkunta. Käräjäkuntaan voi kuulua yksi tai useampia kuntia. Yksi tai useampi käräjäkunta puolestaan muodostaa tuomiokunnan.
broader: ihmisen määrittämät alueet
type: Concept
alternative label: tuomiokunnat
source: www.finlex.fi
part of: käräjäkunnat

käräjäkunnat
preferred label: tingslag @sv
preferred label: rural court districts @en
type: Concept
part of: tuomiokunnat (alueet)