kuvataideopettajat
broader: aineenopettajat
scope note: Nimitys käytössä vuodesta 1999 lähtien, aiemmat katso kuvaamataidonopettajat
related: kuvaamataidonopettajat
in scheme: conceptscheme
preferred label: art teachers @en
type: Concept

aineenopettajat
preferred label: subject teachers @en
preferred label: ämneslärare @sv
type: Concept
narrower: kuvataideopettajat

kuvaamataidonopettajat
preferred label: teckningslärare @sv
type: Concept
related: kuvataideopettajat