motioner
preferred label: motions @en
preferred label: aloitteet @fi
type: Concept
narrower: nordliga dimensionen

nordliga dimensionen
preferred label: Northern Dimension @en
preferred label: pohjoinen ulottuvuus @fi
type: Concept
in scheme: conceptscheme
scope note: Den nordliga dimensionen utgör en bred ram som omfattar samtliga regioner inom det nordliga området, Östersjön, Barents hav och Arktis och samtliga politikområden, såväl externa som interna.
related: dimension
broader: motioner

dimension
preferred label: ulottuvuus @fi
type: Concept
related: nordliga dimensionen