duetter
comment: kahdelle itsenäiselle lauluäänelle kirjoitettu sävellys t. sen esitys, kaksinlaulu
broader: kompositioner
in scheme: conceptscheme
related: vokalmusik
source: Kielitoimiston sanakirja
type: Concept
preferred label: duets @en
preferred label: duetot @fi

kompositioner
preferred label: compositions @en
preferred label: sävellykset @fi
type: Concept
narrower: duetter

vokalmusik
preferred label: vocal music @en
preferred label: laulumusiikki @fi
type: Concept
related: duetter