Declaration of Punta del Este
broader: declarations
scope note: Unescon liikuntakasvatus- ja urheiluasioista vastaavien ministereiden kokouksessaan Uruguayssa 1999 hyväksymä julistus
in scheme: conceptscheme
preferred label: Punta del Esten julistus @fi
type: Concept

declarations
preferred label: proklamationer @sv
preferred label: julistukset @fi
type: Concept
narrower: Declaration of Punta del Este