tunnustus (oikeaksi myöntäminen)
broader: keskinäinen toiminta
in scheme: conceptscheme
preferred label: confession @en
type: Concept
alternative label: tunnustus
alternative label: tunnustaminen
comment: myöntää oikeaksi, todeksi, päteväksi, lailliseksi
source: Kielitoimiston sanakirja

keskinäinen toiminta
preferred label: ömsesidig aktivitet @sv
preferred label: mutual activity @en
type: Concept
narrower: tunnustus (oikeaksi myöntäminen)