parks
preferred label: parker @sv
preferred label: puistot @fi
type: Concept
narrower: Huovila Park

Huovila Park
broader: parks
scope note: Englantilaistyylinen maisemapuisto Kärkölässä
in scheme: conceptscheme
preferred label: Huovila park @sv
preferred label: Huovilan puisto @fi
type: Concept