basso continuo
type: Concept
related: figured bass

harmonics
preferred label: sointuoppi @fi
preferred label: harmonilära @sv
type: Concept
narrower: figured bass

figured bass
preferred label: kenraalibasso @fi
preferred label: generalbas @sv
related: basso continuo
in scheme: conceptscheme
type: Concept
broader: harmonics
comment: harmoniavirtailuun perustuva musiikin hahmotustapa, jossa bassomelodialla on keskeinen asema
source: mute-sanasto