parts of the body
preferred label: kroppsdelar @sv
preferred label: ruumiinosat @fi
type: Concept
narrower: middle ear

ears
preferred label: öronen @sv
preferred label: korvat @fi
type: Concept

middle ear
type: Concept
in scheme: conceptscheme
preferred label: mellanörat @sv
preferred label: välikorva @fi
part of: ears
source: MOT Lääketiede 2.0a
comment: ilman täyttämä korvan keskimmäinen osa, johon kuuluvat mm. täryontelo kuuloluineen ja tärykalvo
broader: parts of the body