naturmedel
broader: produkter
scope note: Medel vars verksamma beståndsdelar är rena naturprodukter.
in scheme: conceptscheme
preferred label: natural products @en
preferred label: luonnontuotteet @fi
type: Concept

produkter
preferred label: products @en
preferred label: tuotteet @fi
type: Concept
narrower: naturmedel